�S���n�������c�̃R�[�h,ID,�n�������c�̖�,����,����_�J�i,����_�p��,����_�ʏ�,POI�R�[�h,�O�����ʎq,�O�����ʎq�̒l,���ݒn_�S���n�������c�̃R�[�h,����ID,���ݒn_�A���\�L,���ݒn_�s���{��,���ݒn_�s�撬��,���ݒn_����,���ݒn_�Ԓn�ȉ�,��������(����),�ܓx,�o�x,���x�̎��,���x�̒l,�d�b�ԍ�,�����ԍ�,�A���惁�[���A�h���X,�A����FormURL,�A������l�i���̑��ASNS�Ȃǁj,�X�֔ԍ�,�@�l�ԍ�,�c�̖�,���p�\�j��,�J�n����,�I������,���p�\���ԓ��L����,����,�Ԉ֎q��,�Ԉ֎q�ݏo,�c�G�ݏo,�o���A�t���[�g�C��,�X���[�v�A�G���x�[�^�A�G�X�J���[�^,�_���u���b�N���̈ړ��x��,�_����Ǐ�ɂ��x��,�ӓ����E����A����������,����,�M�k�Ή�,�D�撓�ԏ�,�I�X�g���C�g�Ή��g�C��,������,���ނւ��R�[�i�[,���H��,�x�r�[�J�[�ݏo,�x�r�[�J�[���p,URL,�摜,�摜_���C�Z���X,���l
131202,1.31202E+11,���n��,���n�����,�l���}�N���N�V��,,,1302,,,131202,0018006,�����s���n��L�ʖk6-12-1,�����s,���n��,�L�ʖk6,12��1��,,35.735789,139.651534,,,(03)3993-1111,,,,,1760012,,,���ΐ��؋�,8:30,17:00,�j�x���A�N���N�n(12/29�`1/3)�͕��B�ꕔ�Ɩ�(�ːЂ̓͏o�E�ؖ��A�Z���[�A��ӏؖ��Ȃ�)�ɂ��ẮA���j���`���j����17���ȍ~�ȂǂɎ��ԊO�����T�[�r�X���s���Ă��܂��B,,,,,,,,,,,,,,,,,,,,,,
131202,1.31202E+11,���n��,�ΐ_�䒡��,�V���N�W�C�`���E�V��,,,1304,,,131202,0039003,�����s���n��ΐ_�䒬3-30-26,�����s,���n��,�ΐ_�䒬3,30-26,,35.743473,139.602553,,,(03)3995-1101,,,,,1770041,,,,,,���ɓ��̊e�����ɂ�藘�p���A���p���Ԃ��قȂ�܂��B,,,,,,,,,,,,,,,,,,,,,,
131202,1.31202E+11,���n��,�������斯�Z���^�[,�i�J�����o�V�N�~���Z���^�[,,,1399,,,131202,0030001,�����s���n��ш�1-9-1,�����s,���n��,�ш�1,9��1��,,35.738505,139.635556,,,,,,,,1760021,,,,,,�斯�Z���^�[���̊e�{�݂ɂ�藘�p���A���p���Ԃ��قȂ�܂��B,,,,,,,,,,,,,,,,,,,,,,
131202,1.31202E+11,���n��,�����u�斯�Z���^�[,�q�J���K�I�J�N�~���Z���^�[,,,1399,,,131202,0012002,�����s���n������u2-9-6,�����s,���n��,�����u2,9��6��,,35.759534,139.629297,,,,,,,,1790072,,,,8:30,21:30,�斯�Z���^�[���̊e�{�݂ɂ�藘�p���A���p���Ԃ��قȂ�܂��B,,,,,,,,,,,,,,,,,,,,,,
131202,1.31202E+11,���n��,�֋斯�Z���^�[,�Z�L�N�~���Z���^�[,,,1399,,,131202,0037001,�����s���n��֒��k1-7-2,�����s,���n��,�֒��k1,7��2��,,35.724633,139.577505,,,,,,,,1770051,,,,8:30,21:30,�斯�Z���^�[���̊e�{�݂ɂ�藘�p���A���p���Ԃ��قȂ�܂��B,,,,,,,,,,,,,,,,,,,,,,
131202,1.31202E+11,���n��,�����u�斯������,�q�J���K�I�J�N�~���W���V��,,,1304,,,131202,0012002,�����s���n������u2-9-6,�����s,���n��,�����u2,9��6��,,35.75938,139.629299,,,(03)5997-7711,,,,,1790072,,,���ΐ��؋�,8:30,19:00,�j�x���A�N���N�n(12/29�`1/3)�͕��B,,,,,,,,,,,,,,,,,,,,,,
131202,1.31202E+11,���n��,���n�斯������,�l���}�N�~���W���V��,,,1304,,,131202,0018006,�����s���n��L�ʖk6-12-1,�����s,���n��,�L�ʖk6,12��1��,,35.735652,139.651533,,,(03)3993-1111,,,,,1760012,,,���ΐ��؋��y,8:30,19:00,�y�j����17���܂ŁB�j�x���A�N���N�n(12/29�`1/3)�A�y�j���Əj�x�����d�Ȃ����ꍇ�͕��B,,,,,,,,,,,,,,,,,,,,,,
131202,1.31202E+11,���n��,�ΐ_��斯������,�V���N�W�C�N�~���W���V��,,,1304,,,131202,0039003,�����s���n��ΐ_�䒬3-30-26,�����s,���n��,�ΐ_�䒬3,30-26,,35.743478,139.602737,,,(03)3995-1103,,,,,1770041,,,���ΐ��؋�,8:30,19:00,�j�x���A�N���N�n(12/29�`1/3)�͕��B,,,,,,,,,,,,,,,,,,,,,,
131202,1.31202E+11,���n��,���斯������,�I�I�C�Y�~�N�~���W���V��,,,1304,,,131202,0014001,�����s���n�擌���1-28-1���Y�����w��4�K,�����s,���n��,�����1,1��28��,���Y�����w��4�K,35.749884,139.587601,,,(03)3922-1171,,,,,1780063,,,���ΐ��؋�,8:30,19:00,�j�x���A�N���N�n(12/29�`1/3)�͕��B,,,,,,,,,,,,,,,,,,,,,,
131202,1.31202E+11,���n��,�֋斯������,�Z�L�N�~���W���V��,,,1304,,,131202,0037001,�����s���n��֒��k1-7-2,�����s,���n��,�֒��k1,7��2��,,35.72464,139.577998,,,(03)3928-3046,,,,,1770051,,,���ΐ��؋�,8:30,19:00,�j�x���A�N���N�n(12/29�`1/3)�͕��B,,,,,,,,,,,,,,,,,,,,,,
131202,1.31202E+11,���n��,���{�斯������,�n���~���N�~���W���V��,,,1304,,,131202,0007001,�����s���n�摁�{1-44-19,�����s,���n��,���{1,44-19,,35.754166,139.658812,,,(03)3994-6705,,,,,1790085,,,���ΐ��؋�,8:30,19:00,�j�x���A�N���N�n(12/29�`1/3)�͕��B,,,,,,,,,,,,,,,,,,,,,,
131202,1.31202E+11,���n��,�����y�؏o����,�g�E�u�h�{�N�V���b�`���E�W��,,,1304,,,131202,0020003,�����s���n��L�ʒ�3-28-8,�����s,���n��,�L�ʒ�3,8��28��,,35.731263,139.652717,,,(03)3994-0083,,,,,1760013,,,���ΐ��؋�,8:30,17:15,�j�x���A�N���N�n(12/29�`1/3)�͕�,,,,,,,,,,,,,,,,,,,,,,
131202,1.31202E+11,���n��,�����y�؏o����,�Z�C�u�h�{�N�V���b�`���E�W��,,,1304,,,131202,0039003,�����s���n��ΐ_�䒬3-30-26,�����s,���n��,�ΐ_�䒬3,30-26,,35.743133,139.602758,,,(03)3995-0083,,,,,1770041,,,���ΐ��؋�,8:30,17:15,�j�x���A�N���N�n(12/29�`1/3)�͕�,,,,,,,,,,,,,,,,,,,,,,
131202,1.31202E+11,���n��,���n��������������,�l���}�\�E�S�E�t�N�V�W���V��,,,1407,,,131202,0018006,�����s���n��L�ʖk6-12-1������2F,�����s,���n��,�L�ʖk6,12��1��,������2F,35.736093,139.65135,,,(03)3993-1111,,,,,1760012,,,���ΐ��؋�,8:30,17:15,�j�x���A�N���N�n(12/29�`1/3)�͕��B,,,,,,,,,,,,,,,,,,,,,,
131202,1.31202E+11,���n��,�����u��������������,�q�J���K�I�J�\�E�S�E�t�N�V�W���V��,,,1407,,,131202,0012002,�����s���n������u2-9-6�����u�斯�Z���^�[2F,�����s,���n��,�����u2,9��6��,�����u�斯�Z���^�[2F,35.759534,139.629476,,,(03)5997-7713,,,,,1790072,,,���ΐ��؋�,8:30,17:15,�j�x���A�N���N�n(12/29�`1/3)�͕��B,,,,,,,,,,,,,,,,,,,,,,
131202,1.31202E+11,���n��,�ΐ_�䑍������������,�V���N�W�C�\�E�S�E�t�N�V�W���V��,,,1407,,,131202,0039003,�����s���n��ΐ_�䒬3-30-26�ΐ_�䒡��3�E4F,�����s,���n��,�ΐ_�䒬3,30-26,�ΐ_�䒡��3�E4F,35.743319,139.602552,,,(03)5393-2801,,,,,1770041,,,���ΐ��؋�,8:30,17:15,�j�x���A�N���N�n(12/29�`1/3)�͕��B,,,,,,,,,,,,,,,,,,,,,,
131202,1.31202E+11,���n��,��򑍍�����������,�I�I�C�Y�~�\�E�S�E�t�N�V�W���V��,,,1407,,,131202,0014001,�����s���n�擌���1-29-1��߂肠1��4�E9F,�����s,���n��,�����1,1��29��,��߂肠1��4�E9F,35.75026,139.585572,,,(03)5905-5262,,,,,1780063,,,���ΐ��؋�,8:30,17:15,�j�x���A�N���N�n(12/29�`1/3)�͕��B,,,,,,,,,,,,,,,,,,,,,,
131202,1.31202E+11,���n��,���n��ی���,�l���}�N�z�P���W��,,,1606,,,131202,0018006,�����s���n��L�ʖk6-12-1,�����s,���n��,�L�ʖk6,12��1��,,35.735516,139.652374,,,(03)3993-1111,,,,,1760012,,,���ΐ��؋�,8:30,17:00,�j�x���A�N���N�n(12/29�`1/3)�͕��B,,,,,,,,,,,,,,,,,,,,,,
131202,1.31202E+11,���n��,�����u�ی����k��,�q�J���K�I�J�z�P���\�E�_���V��,,,1399,,,131202,0012002,�����s���n������u2-9-6,�����s,���n��,�����u2,9��6��,,35.759387,139.629472,,,(03)5997-7722,,,,,1790072,,,���ΐ��؋�,8:30,17:00,�j�x���A�N���N�n(12/29�`1/3)�͕��B,,,,,,,,,,,,,,,,,,,,,,
131202,1.31202E+11,���n��,�ΐ_��ی����k��,�V���N�W�C�z�P���\�E�_���V��,,,1399,,,131202,0039007,�����s���n��ΐ_�䒬7-3-28,�����s,���n��,�ΐ_�䒬7,3��28��,,35.744607,139.601338,,,(03)3996-0634,,,,,1770041,,,���ΐ��؋�,8:30,17:00,�j�x���A�N���N�n(12/29�`1/3)�͕��B,,,,,,,,,,,,,,,,,,,,,,
131202,1.31202E+11,���n��,���ی����k��,�I�I�C�Y�~�z�P���\�E�_���V��,,,1399,,,131202,0045005,�����s���n����w����5-8-8,�����s,���n��,���w����5,8��8��,,35.767095,139.586492,,,(03)3921-0217,,,,,1780061,,,���ΐ��؋�,8:30,17:00,�j�x���A�N���N�n(12/29�`1/3)�͕��B,,,,,,,,,,,,,,,,,,,,,,
131202,1.31202E+11,���n��,�L�ʕی����k��,�g���^�}�z�P���\�E�_���V��,,,1399,,,131202,0018005,�����s���n��L�ʖk5-15-19,�����s,���n��,�L�ʖk5,15-19,,35.735889,139.654992,,,(03)3992-1188,,,,,1760012,,,���ΐ��؋�,8:30,17:00,�j�x���A�N���N�n(12/29�`1/3)�͕��B,,,,,,,,,,,,,,,,,,,,,,
131202,1.31202E+11,���n��,�֕ی����k��,�Z�L�z�P���\�E�_���V��,,,1399,,,131202,0036001,�����s���n��֒���1-27-4,�����s,���n��,�֒���1,4��27��,,35.726414,139.581385,,,(03)3929-5381,,,,,1770052,,,���ΐ��؋�,8:30,17:00,�j�x���A�N���N�n(12/29�`1/3)�͕��B,,,,,,,,,,,,,,,,,,,,,,
131202,1.31202E+11,���n��,�k�ی����k��,�L�^�z�P���\�E�_���V��,,,1399,,,131202,0042006,�����s���n��k��6-35-7,�����s,���n��,�k��6,Jul-35,,35.757224,139.649632,,,(03)3931-1347,,,,,1790081,,,���ΐ��؋�,8:30,17:00,�j�x���A�N���N�n(12/29�`1/3)�͕��B,,,,,,,,,,,,,,,,,,,,,,
131202,1.31202E+11,���n��,���n��ی��������q���ېΐ_�䕪��,�l���}�N�z�P���W���Z�C�J�c�G�C�Z�C�J�V���N�W�C�u���V�c,,,1399,,,131202,0039007,�����s���n��ΐ_�䒬7-3-28,�����s,���n��,�ΐ_�䒬7,3��28��,,35.74471,139.601228,,,(03)3996-0633,,,,,1770041,,,���ΐ��؋�,8:30,17:00,�j�x���A�N���N�n(12/29�`1/3)�͕��B,,,,,,,,,,,,,,,,,,,,,,
131202,1.31202E+11,���n��,�����������,�R�E�Z�C�u���J�J�C�J��,,,1499,,,131202,0028004,�����s���n����n4-2-3,�����s,���n��,���n4,2��3��,,35.740217,139.650256,,,(03)3991-3080,,,,,1760001,,,���ΐ��؋��y��,9:00,21:30,����������ٓ��̊e�����ɂ��x�ٓ��A���p���Ԃ��قȂ�܂��B,,,,,,,,,,,,,,,,,,,,,,
131202,1.31202E+11,���n��,���n��Љ�����c��,�l���}�N�V���J�C�t�N�V�L���E�M�J�C,,,1399,,,131202,0018005,�����s���n��L�ʖk5-14-6,�����s,���n��,�L�ʖk5,6��14��,,35.735559,139.652313,,,(03)3992-5600,,,,,1760012,,,���ΐ��؋�,8:30,17:15,�j�x���A�N���N�n(12/29�`1/3)�͕��B,,,,,,,,,,,,,,,,,,,,,,
131202,1.31202E+11,���n��,�����i��Z���^�[ �ق��ƃT�|�[�g�˂��,�P�������E�S�Z���^�[ �z�b�g�T�|�[�g�l���},,,1399,,,131202,0018005,�����s���n��L�ʖk5-14-6,�����s,���n��,�L�ʖk5,6��14��,,35.735418,139.652182,,,(03)5912-4022,,,,,1760012,,,���ΐ��؋�,9:00,17:00,�j�x���A�N���N�n(12/29�`1/3)�͕��B,,,,,,,,,,,,,,,,,,,,,,
131202,1.31202E+11,���n��,���n��Љ�����ƒc,�l���}�N�V���J�C�t�N�V�W�M���E�_��,,,1399,,,131202,0012006,�����s���n������u6-4-1,�����s,���n��,�����u6,4��1��,,35.760202,139.623233,,,(03)6758-0140,,,,,1790072,,,���ΐ��؋�,9:00,17:00,�j�x���A�N���N�n(12/29�`1/3)�͕��B,,,,,,,,,,,,,,,,,,,,,,
131202,1.31202E+11,���n��,���n��V���o�[�l�ރZ���^�[,�l���}�N�V���o�[�W���U�C�Z���^�[,,,1399,,,131202,0018005,�����s���n��L�ʖk5-29-8,�����s,���n��,�L�ʖk5,8��29��,,35.735973,139.652886,,,(03)3993-7168,,,,,1760012,,,���ΐ��؋�,8:30,17:15,�j�x���A�N���N�n(12/29�`1/3)�͕��B,,,,,,,,,,,,,,,,,,,,,,
131202,1.31202E+11,���n��,�͂�Z���^�[�����u,�n�c���c�Z���^�[�q�J���K�I�J,,,1499,,,131202,0012002,�����s���n������u2-9-6,�����s,���n��,�����u2,9��6��,,35.759474,139.630185,,,(03)5997-7717,,,,,1790072,,,���ΐ��؋��y,9:00,17:00,�j�x��(�h�V�̓��ɂ�����Ƃ��͊J��)�A�N���N�n(12/29�`1/3)�͋x�فB,,,,,,,,,,,,,,,,,,,,,,
131202,1.31202E+11,���n��,�͂�Z���^�[��,�n�c���c�Z���^�[�Z�L,,,1499,,,131202,0037001,�����s���n��֒��k1-7-2,�����s,���n��,�֒��k1,7��2��,,35.724479,139.577796,,,(03)3928-1987,,,,,1770051,,,���ΐ��؋��y,9:00,17:00,�j�x��(�h�V�̓��ɂ�����Ƃ��͊J��)�A�N���N�n(12/29�`1/3)�͋x�فB,,,,,,,,,,,,,,,,,,,,,,
131202,1.31202E+11,���n��,�͂�Z���^�[�L��,�n�c���c�Z���^�[�g���^�},,,1499,,,131202,0020003,�����s���n��L�ʒ�3-3-12,�����s,���n��,�L�ʒ�3,3��12��,,35.732151,139.65534,,,(03)5912-6401,,,,,1760013,,,���ΐ��؋��y��,9:00,21:30,�j�x��(�h�V�̓��ɂ�����Ƃ��͊J��)�A�N���N�n(12/29�`1/3)�͋x�فB������R���j���͌ߌ�T���فB,,,,,,,,,,,,,,,,,,,,,,
131202,1.31202E+11,���n��,�͂�Z���^�[���,�n�c���c�Z���^�[�I�I�C�Y�~,,,1499,,,131202,0045001,�����s���n����w����1-34-20,�����s,���n��,���w����1,34-20,,35.763472,139.589173,,,(03)3867-3180,,,,,1780061,,,���ΐ��؋��y��,9:00,21:30,�j�x��(�h�V�̓��ɂ�����Ƃ��͊J��)�A�N���N�n(12/29�`1/3)�͋x�فB������R���j���͌ߌ�T���فB,,,,,,,,,,,,,,,,,,,,,,
131202,1.31202E+11,���n��,�h���h�V��,�T�J�G�`���E�P�C���E�J��,,,1499,,,131202,0023000,�����s���n��h��40-7,�����s,���n��,�h��,Jul-40,,35.73946,139.671363,,,(03)3994-3286,,,,,1760006,,,���ΐ��؋��y,9:00,17:00,�j�x��(�h�V�̓��ɂ�����Ƃ��͊J��)�A�N���N�n(12/29�`1/3)�͋x�فB,,,,,,,,,,,,,,,,,,,,,,
131202,1.31202E+11,���n��,��c���h�V��,�~�i�~�^�i�J�P�C���E�J��,,,1499,,,131202,0003005,�����s���n���c��5-15-25,�����s,���n��,��c��5,15-25,,35.73778,139.611508,,,(03)3995-5538,,,,,1770035,,,���ΐ��؋��y,9:00,17:00,�j�x��(�h�V�̓��ɂ�����Ƃ��͊J��)�A�N���N�n(12/29�`1/3)�͋x�فB,,,,,,,,,,,,,,,,,,,,,,
131202,1.31202E+11,���n��,�O����h�V��,�~�n���_�C�P�C���E�J��,,,1499,,,131202,0013002,�����s���n��O����2-11-29,�����s,���n��,�O����2,11��29��,,35.757321,139.606341,,,(03)3924-8834,,,,,1770031,,,���ΐ��؋��y,9:00,17:00,�j�x��(�h�V�̓��ɂ�����Ƃ��͊J��)�A�N���N�n(12/29�`1/3)�͋x�فB,,,,,,,,,,,,,,,,,,,,,,
131202,1.31202E+11,���n��,�ΐ_��h�V��,�V���N�W�C�P�C���E�J��,,,1499,,,131202,0039007,�����s���n��ΐ_�䒬7-28-21,�����s,���n��,�ΐ_�䒬7,28-21,,35.744792,139.598138,,,(03)3996-2900,,,,,1770041,,,���ΐ��؋��y,9:00,17:00,�j�x��(�h�V�̓��ɂ�����Ƃ��͊J��)�A�N���N�n(12/29�`1/3)�͋x�فB,,,,,,,,,,,,,,,,,,,,,,
131202,1.31202E+11,���n��,�ΐ_���h�V��,�V���N�W�C�_�C�P�C���E�J��,,,1499,,,131202,0038002,�����s���n��ΐ_���2-18-13,�����s,���n��,�ΐ_���2,18-13,,35.735428,139.589647,,,(03)3995-8270,,,,,1770045,,,���ΐ��؋��y,9:00,17:00,�j�x��(�h�V�̓��ɂ�����Ƃ��͊J��)�A�N���N�n(12/29�`1/3)�͋x�فB,,,,,,,,,,,,,,,,,,,,,,
131202,1.31202E+11,���n��,�����h�V��,�q�K�V�I�I�C�Y�~�P�C���E�J��,,,1499,,,131202,0014007,�����s���n�擌���7-20-1,�����s,���n��,�����7,1��20��,,35.742321,139.577051,,,(03)3921-9129,,,,,1780063,,,���ΐ��؋��y,9:00,17:00,�j�x��(�h�V�̓��ɂ�����Ƃ��͊J��)�A�N���N�n(12/29�`1/3)�͋x�فB,,,,,,,,,,,,,,,,,,,,,,
131202,1.31202E+11,���n��,�����h�V��,�j�V�I�I�C�Y�~�P�C���E�J��,,,1499,,,131202,0016003,�����s���n�搼���3-21-16,�����s,���n��,�����3,21-16,,35.759402,139.578866,,,(03)3924-9545,,,,,1780065,,,���ΐ��؋��y,9:00,17:00,�j�x��(�h�V�̓��ɂ�����Ƃ��͊J��)�A�N���N�n(12/29�`1/3)�͋x�فB,,,,,,,,,,,,,,,,,,,,,,
131202,1.31202E+11,���n��,���k�h�V��,�I�I�C�Y�~�L�^�P�C���E�J��,,,1499,,,131202,0045004,�����s���n����w����4-21-1,�����s,���n��,���w����4,1��21��,,35.765476,139.588368,,,(03)3925-7105,,,,,1780061,,,���ΐ��؋��y,9:00,17:00,�j�x��(�h�V�̓��ɂ�����Ƃ��͊J��)�A�N���N�n(12/29�`1/3)�͋x�فB,,,,,,,,,,,,,,,,,,,,,,
131202,1.31202E+11,���n��,�����h�V��,�^�J�m�_�C�P�C���E�J��,,,1499,,,131202,0004002,�����s���n�捂���2-25-1,�����s,���n��,�����2,1��25��,,35.747846,139.620932,,,(03)3996-5135,,,,,1770033,,,���ΐ��؋��y,9:00,17:00,�j�x��(�h�V�̓��ɂ�����Ƃ��͊J��)�A�N���N�n(12/29�`1/3)�͋x�فB,,,,,,,,,,,,,,,,,,,,,,
131202,1.31202E+11,���n��,��ΐ_��h�V��,�J�~�V���N�W�C�P�C���E�J��,,,1499,,,131202,0034001,�����s���n���ΐ_��1-6-16,�����s,���n��,��ΐ_��1,6��16��,,35.725235,139.59234,,,(03)3928-8623,,,,,1770044,,,���ΐ��؋��y,9:00,17:00,�j�x��(�h�V�̓��ɂ�����Ƃ��͊J��)�A�N���N�n(12/29�`1/3)�͋x�فB,,,,,,,,,,,,,,,,,,,,,,
131202,1.31202E+11,���n��,���n�f�C�T�[�r�X�Z���^�[,�l���}�f�C�T�[�r�X�Z���^�[,,,1409,,,131202,0028002,�����s���n����n2-24-3,�����s,���n��,���n2,3��24��,,35.74412,139.65413,,,(03)5984-1701,,,,,1760001,,,���ΐ��؋��y,8:30,17:30,�N���N�n(12/31�`1/3)�͋x�ƁB,,,,,,,,,,,,,,,,,,,,,,
131202,1.31202E+11,���n��,�уf�C�T�[�r�X�Z���^�[,�j�V�L�f�C�T�[�r�X�Z���^�[,,,1409,,,131202,0041002,�����s���n���2-6-14,�����s,���n��,��2,6��14��,,35.761711,139.666103,,,(03)3937-5031,,,,,1790082,,,���ΐ��؋��y,8:30,17:30,�N���N�n(12/31�`1/3)�͋x�ƁB,,,,,,,,,,,,,,,,,,,,,,
131202,1.31202E+11,���n��,�����u�f�C�T�[�r�X�Z���^�[,�q�J���K�I�J�f�C�T�[�r�X�Z���^�[,,,1409,,,131202,0012002,�����s���n������u2-9-6,�����s,���n��,�����u2,9��6��,,35.75939,139.629647,,,(03)5997-7706,,,,,1790072,,,���ΐ��؋��y,8:30,17:00,�N���N�n(12/29�`1/3)�͋x�ƁB,,,,,,,,,,,,,,,,,,,,,,
131202,1.31202E+11,���n��,�����f�C�T�[�r�X�Z���^�[,�q�K�V�I�I�C�Y�~�f�C�T�[�r�X�Z���^�[,,,1409,,,131202,0014005,�����s���n�擌���5-15-2,�����s,���n��,�����5,2��15��,,35.743687,139.589414,,,(03)5387-1021,,,,,1780063,,,���ΐ��؋��y,8:30,17:30,�N���N�n(12/31�`1/3)�͋x�ƁB,,,,,,,,,,,,,,,,,,,,,,
131202,1.31202E+11,���n��,�y�x�c�f�C�T�[�r�X�Z���^�[,�h�V�_�f�C�T�[�r�X�Z���^�[,,,1409,,,131202,0043002,�����s���n��y�x�c2-40-18,�����s,���n��,�y�x�c2,40-18,,35.764291,139.611332,,,(03)5387-6760,,,,,1790076,,,���ΐ��؋��y,8:30,17:30,�N���N�n(12/31�`1/3)�͋x�ƁB,,,,,,,,,,,,,,,,,,,,,,
131202,1.31202E+11,���n��,�����f�C�T�[�r�X�Z���^�[,�^�J�}�c�f�C�T�[�r�X�Z���^�[,,,1409,,,131202,0001006,�����s���n�捂��6-3-24,�����s,���n��,����6,3��24��,,35.757037,139.619625,,,(03)3995-5107,,,,,1790075,,,���ΐ��؋��y,8:30,17:30,�N���N�n(12/31�`1/3)�͋x�ƁB,,,,,,,,,,,,,,,,,,,,,,
131202,1.31202E+11,���n��,�����f�C�T�[�r�X�Z���^�[,�^�J�m�_�C�f�C�T�[�r�X�Z���^�[,,,1409,,,131202,0004005,�����s���n�捂���5-24-1,�����s,���n��,�����5,1��24��,,35.746598,139.609576,,,(03)5923-0831,,,,,1770033,,,���ΐ��؋��y,9:00,19:00,�N���N�n(12/29�`1/3)�͋x�ƁB,,,,,,,,,,,,,,,,,,,,,,
131202,1.31202E+11,���n��,���n���w�Z�f�C�T�[�r�X�Z���^�[,�l���}�`���E�K�b�R�E�f�C�T�[�r�X�Z���^�[,,,1409,,,131202,0001001,�����s���n�捂��1-24-1,�����s,���n��,����1,1��24��,,35.747896,139.635525,,,(03)5241-5451,,,,,1790075,,,���ΐ��؋��y,9:00,17:00,�j�x���A�N���N�n(12/29�`1/3)�͋x�ƁB,,,,,,,,,,,,,,,,,,,,,,
131202,1.31202E+11,���n��,�L�ʃf�C�T�[�r�X�Z���^�[,�g���^�}�f�C�T�[�r�X�Z���^�[,,,1409,,,131202,0017003,�����s���n��L�ʓ�3-9-13,�����s,���n��,�L�ʓ�3,9��13��,,35.727699,139.652769,,,(03)3993-1341,,,,,1760014,,,���ΐ��؋��y,8:30,17:30,�N���N�n(12/31�`1/3)�͋x�ƁB,,,,,,,,,,,,,,,,,,,,,,
131202,1.31202E+11,���n��,�����������P�A�Z���^�[�i�S�g��Q�ҕ����Z���^�[�j,�i�J�����o�V�t�N�V�P�A�Z���^�[�i�V���V���V���E�K�C�V���t�N�V�Z���^�[�j,,,1499,,,131202,0030001,�����s���n��ш�1-9-1,�����s,���n��,�ш�1,9��1��,,35.738231,139.635557,,,(03)3926-7211,,,,,1760021,,,,,,,,,,,,,,,,,,,,,,,,,,,,�ߘa�U�N�S������ߘa�V�N10���܂ŉ��C��
131202,1.31202E+11,���n��,���ǂ����B�x���Z���^�[,�R�h���n�b�^�c�V�G���Z���^�[,,,1499,,,131202,0012003,�����s���n������u3-1-1,�����s,���n��,�����u3,1��1��,,35.753996,139.630657,,,(03)3975-6251,,,,,1790072,,,���ΐ��؋��y,9:00,17:30,�y�j����17���܂ŁB�j�x���A�N���N�n(12/29�`1/3)�͕��B,,,,,,,,,,,,,,,,,,,,,,
131202,1.31202E+11,���n��,�������蕟����Ə�,�J�^�N���t�N�V�T�M���E�W��,,,1499,,,131202,0044003,�����s���n����3-27-10,�����s,���n��,���3,10��27��,,35.766973,139.598216,,,(03)5387-4610,,,,,1780062,,,,9:00,16:00,,,,,,,,,,,,,,,,,,,,,,,
131202,1.31202E+11,���n��,�ш䕟���H�[�i�A�J�T�|�[�g�˂�܁j,�k�N�C�t�N�V�R�E�{�E�i�V���E���E�T�|�[�g�l���}�j,,,1499,,,131202,0030002,�����s���n��ш�2-16-12,�����s,���n��,�ш�2,12��16��,,35.738575,139.631068,,,(03)5987-0401,,,,,1760021,,,,,,,,,,,,,,,,,,,,,,,,,,,,
131202,1.31202E+11,���n��,�k��������Ə�,�L�^�}�`�t�N�V�T�M���E�W��,,,1499,,,131202,0042008,�����s���n��k��8-2-12,�����s,���n��,�k��8,2��12��,,35.764139,139.651025,,,(03)3559-0361,,,,,1790081,,,���ΐ��؋�,9:00,16:00,�y�j���͌�1��J���B�j�x���A�N���N�n(12/29�`1/3)�͕��B,,,,,,,,,,,,,,,,,,,,,,
131202,1.31202E+11,���n��,���S��������Ə�,�V�������t�N�V�T�M���E�W��,,,1499,,,131202,0039005,�����s���n��ΐ_�䒬5-13-10,�����s,���n��,�ΐ_�䒬5,10��13��,,35.736439,139.599794,,,(03)3995-7796,,,,,1770041,,,,,,,,,,,,,,,,,,,,,,,,,,,,
131202,1.31202E+11,���n��,�X��䕟����,�q�J���_�C�t�N�V�G��,,,1499,,,131202,0006002,�����s���n��X���2-16-2,�����s,���n��,�X���2,2��16��,,35.756662,139.66782,,,(03)3931-0167,,,,,1790084,,,���ΐ��؋�,9:30,15:30,�j�x���A�N���N�n(12/29�`1/3)�͋x��,,,,,,,,,,,,,,,,,,,,,,
131202,1.31202E+11,���n��,�����u������,�q�J���K�I�J�t�N�V�G��,,,1499,,,131202,0012002,�����s���n������u2-4-10,�����s,���n��,�����u2,4��10��,,35.763969,139.633332,,,(03)3976-5100,,,,,1790072,,,���ΐ��؋�,9:30,15:30,�j�x���A�N���N�n(12/29�`1/3)�͋x���B,,,,,,,,,,,,,,,,,,,,,,
131202,1.31202E+11,���n��,��򒬕�����,�I�I�C�Y�~�}�`�t�N�V�G��,,,1499,,,131202,0044003,�����s���n����3-29-20,�����s,���n��,���3,29-20,,35.766984,139.597246,,,(03)5387-4681,,,,,1780062,,,,,,,,,,,,,,,,,,,,,,,,,,,,
131202,1.31202E+11,���n��,���w����������,�I�I�C�Y�~�K�N�G���`���E�t�N�V�G��,,,1499,,,131202,0045003,�����s���n����w����3-9-20,�����s,���n��,���w����3,9��20��,,35.761289,139.582012,,,(03)3923-8540,,,,,1780061,,,,,,,,,,,,,,,,,,,,,,,,,,,,
131202,1.31202E+11,���n��,�֒�������,�Z�L�}�`�t�N�V�G��,,,1499,,,131202,0031003,�����s���n��֒���3-15-35,�����s,���n��,�֒���3,15-35,,35.72247,139.579502,,,(03)3594-0217,,,,,1770053,,,,,,,,,,,,,,,,,,,,,,,,,,,,
131202,1.31202E+11,���n��,�ш䕟����,�k�N�C�t�N�V�G��,,,1499,,,131202,0030002,�����s���n��ш�2-16-12,�����s,���n��,�ш�2,12��16��,,35.738712,139.631068,,,(03)5987-0400,,,,,1760021,,,,,,,,,,,,,,,,,,,,,,,,,,,,
131202,1.31202E+11,���n��,�L�ʏ�Q�Ғn�搶���x���Z���^�[�����,�g���^�}�V���E�K�C�V���`�C�L�Z�C�J�c�V�G���Z���^�[�L����,,,1499,,,131202,0018005,�����s���n��L�ʖk5-15-19-6�K,�����s,���n��,�L�ʖk5,15-19-6�K,,35.73602,139.65499,,,(03)3557-9222,,,,,1760012,,,���Ζ؋��y��,,,�j�x���A�N���N�n(12/29�`1/3)�͕��B�y����12������B,,,,,,,,,,,,,,,,,,,,,,
131202,1.31202E+11,���n��,�����u��Q�Ғn�搶���x���Z���^�[���Ă���,�q�J���K�I�J�V���E�K�C�V���`�C�L�Z�C�J�c�V�G���Z���^�[�X�e�b�v,,,1499,,,131202,0012002,�����s���n������u2-9-6,�����s,���n��,�����u2,9��6��,,35.759237,139.629476,,,(03)5997-7858,,,,,1790072,,,�����؋��y��,9:00,20:00,�j�x���A�N���N�n(12/29�`1/3)�͕��B�y����12������B,,,,,,,,,,,,,,,,,,,,,,
131202,1.31202E+11,���n��,�ΐ_���Q�Ғn�搶���x���Z���^�[������,�V���N�W�C�V���E�K�C�V���`�C�L�Z�C�J�c�V�G���Z���^�[�E�C���O,,,1499,,,131202,0039007,�����s���n��ΐ_�䒬7-3-28,�����s,���n��,�ΐ_�䒬7,3��28��,,35.744605,139.601129,,,(03)3997-2181,,,,,1770041,,,�����؋��y��,,,�j�x���A�N���N�n(12/29�`1/3)�͕��B�y����12������B,,,,,,,,,,,,,,,,,,,,,,
131202,1.31202E+11,���n��,����Q�Ғn�搶���x���Z���^�[������,�I�I�C�Y�~�V���E�K�C�V���`�C�L�Z�C�J�c�V�G���Z���^�[�T�N��,,,1499,,,131202,0014005,�����s���n�擌���5-35-2,�����s,���n��,�����5,Feb-35,,35.747513,139.589614,,,(03)3925-7371,,,,,1780063,,,���Ζ؋��y��,9:00,20:00,�j�x���A�N���N�n(12/29�`1/3)�͕��B�y����12������B,,,,,,,,,,,,,,,,,,,,,,
131202,1.31202E+11,���n��,�����葑,�V�������\�E,,,1499,,,131202,0028003,�����s���n����n3-20-7,�����s,���n��,���n3,7��20��,,35.739037,139.650005,,,(03)5946-9172,,,,,1760001,,,,,,,,,,,,,,,,,,,,,,,,,,,,
131202,1.31202E+11,���n��,�S�g��Q�ҕ����W�,�V���V���V���E�K�C�V���t�N�V�V���E�J�C�W��,,,1499,,,131202,0012002,�����s���n������u2-9-6,�����s,���n��,�����u2,9��6��,,35.759236,139.629831,,,(03)5997-9700,,,,,1790072,,,���ΐ��؋��y��,9:00,21:30,�����͌��j��������j����13���`16���B�N���N�n(12/29�`1/3)�͕��B,,,,,,,,,,,,,,,,,,,,,,
131202,1.31202E+11,���n��,�J���t�����h,���n���t�����h,,,1499,,,131202,0005005,�����s���n��J��5-6-5,�����s,���n��,�J��5,6��5��,,35.751203,139.61289,,,(03)5910-8488,,,,,1770032,,,���ΐ��؋��y,9:30,15:30,�j�x���A�N���N�n(12/29�`1/3)�͕��B,,,,,,,,,,,,,,,,,,,,,,
131202,1.31202E+11,���n��,���n�掑���z�Z���^�[,�l���}�N�V�Q���W�����J���Z���^�[,,,2005,,,131202,0005001,�����s���n��J��1-2-20,�����s,���n��,�J��1,2��20��,,35.748407,139.62367,,,(03)3995-6711,,,,,1770032,,,���ΐ��؋��y��,9:00,17:00,�N���N�n(12/29�`1/3)�͕��B,,,,,,,,,,,,,,,,,,,,,,
131202,1.31202E+11,���n��,���n�旧�t�������T�C�N���Z���^�[,�l���}�N���c�J�X�K�`���E���T�C�N���Z���^�[,,,2005,,,131202,0008002,�����s���n��t����2-14-16,�����s,���n��,�t����2,14-16,,35.756006,139.647893,,,(03)3926-2501,,,,,1790074,,,���Ζ؋��y��,9:00,17:00,���j�����j�x���̏ꍇ�͊J�ق��A���̒���̏j�x���łȂ������x�فB�N���N�n(12/29�`1/3)�͋x�فB,,,,,,,,,,,,,,,,,,,,,,
131202,1.31202E+11,���n��,���n�旧�֒����T�C�N���Z���^�[,�l���}�N���c�Z�L�}�`���T�C�N���Z���^�[,,,2005,,,131202,0037001,�����s���n��֒��k1-7-14,�����s,���n��,�֒��k1,7��14��,,35.725001,139.577948,,,(03)3594-5351,,,,,1770051,,,���Ζ؋��y��,9:00,17:00,���j�����j�x���̏ꍇ�͊J�ق��A���̒���̏j�x���łȂ������x�فB�N���N�n(12/29�`1/3)�͋x�فB,,,,,,,,,,,,,,,,,,,,,,
131202,1.31202E+11,���n��,���n�旧�L�ʃ��T�C�N���Z���^�[,�l���}�N���c�g���^�}���T�C�N���Z���^�[,,,2005,,,131202,0022002,�����s���n��L�ʏ�2-22-15,�����s,���n��,�L�ʏ�2,22-15,,35.737042,139.660298,,,(03)5999-3196,,,,,1760011,,,���Ζ؋��y��,9:00,17:00,���j�����j�x���̏ꍇ�͊J�ق��A���̒���̏j�x���łȂ������x�فB�N���N�n(12/29�`1/3)�͋x�فB,,,,,,,,,,,,,,,,,,,,,,
131202,1.31202E+11,���n��,���n�旧��򃊃T�C�N���Z���^�[,�l���}�N���c�I�I�C�Y�~���T�C�N���Z���^�[,,,2005,,,131202,0045001,�����s���n����w����1-34-10,�����s,���n��,���w����1,Oct-34,,35.76307,139.590924,,,(03)3978-4030,,,,,1780061,,,���Ζ؋��y��,9:00,17:00,���j�����j�x���̏ꍇ�͊J�ق��A���̒���̏j�x���łȂ������x�فB�N���N�n(12/29�`1/3)�͋x�فB,,,,,,,,,,,,,,,,,,,,,,
131202,1.31202E+11,���n��,���n���|������,�l���}�Z�C�\�E�W���V��,,,2099,,,131202,0022002,�����s���n��L�ʏ�2-22-15,�����s,���n��,�L�ʏ�2,22-15,,35.737044,139.660098,,,(03)3992-7141,,,,,1760011,,,���ΐ��؋��y,7:40,16:25,�N���N�n(12/29�`1/3)�͕��B,,,,,,,,,,,,,,,,,,,,,,
131202,1.31202E+11,���n��,�ΐ_�䐴�|������,�V���N�W�C�Z�C�\�E�W���V��,,,2099,,,131202,0034003,�����s���n���ΐ_��3-34-25,�����s,���n��,��ΐ_��3,34-25,,35.731192,139.590203,,,(03)3928-1353,,,,,1770044,,,���ΐ��؋��y,7:40,16:25,�N���N�n(12/29�`1/3)�͕��B,,,,,,,,,,,,,,,,,,,,,,
131202,1.31202E+11,���n��,�J�����|���Ə�,���n���Z�C�\�E�W�M���E�V��,,,2099,,,131202,0005005,�����s���n��J��5-5-11,�����s,���n��,�J��5,5��11��,,35.75172,139.611324,,,(03)5393-3001,,,,,1770032,,,,,,,,,,,,,,,,,,,,,,,,,,,,
131202,1.31202E+11,���n��,�h�Њw�K�Z���^�[,�{�E�T�C�K�N�V���E�Z���^�[,,,1399,,,131202,0012006,�����s���n������u6-4-1,�����s,���n��,�����u6,4��1��,,35.76022,139.623022,,,(03)5997-6471,,,,,1790072,,,�ΐ��؋��y��,10:00,18:00,���C����9���`21��30���B���j�����j�x���̏ꍇ�͊J�ق��A���̒���̏j�x���łȂ������x�فB�N���N�n(12/29�`1/3)�͕فB���C���͔N���N�n�̂݋x�فB,,,,,,,,,,,,,,,,,,,,,,